{"text_format":"1","workbook":"xlsx","n_sheets":11,"sheets":["Introductie","Vragenlijst","Adviesrichting","Investeringstabel","tussenstap advies","stringopbouw advies","adviesopties","Sheet1","koudemiddelen","dropdowns","dynamische dropdowns"],"not_rendered":{"charts":0,"images":6,"macros":1,"external_links":0,"defined_names":16,"comments":6,"pivot_tables":0},"unopened":[],"bounds":{"document_bytes":16777216,"sheet_cells":100000,"rows_first":2000,"rows_last":500,"rows_between":2000,"halvings":0,"cell_chars":16384,"cell_head_chars":4096},"cells_cut":0,"cells_raw":0,"read":"whole","date_system":"1900"}

{"sheet":"Introductie","index":0,"n_rows":21,"n_cols":5,"rows_kept":21,"cut":false,"hidden":false,"merged":[[1,3,15,3],[1,4,20,4]]}
[]
[null,"Introductie",null,"Disclaimer:                                                                                                                                                                                                                                                                                            In deze cel kan specifieke informatie worden opgenomen, die nadere toelichting verstrekt over bijzondere consequenties, voorwaarden, aandachtspunten van de voorgestelde aanpassingen. Vaste punten zullen zijn:","-  Verandering van wetgeving in de toekomst\n-\tAltijd het resultaat verder bekijken met de specifieke behoefte van het bedrijf. Een bepaald algoritme werd gebruikt. Het is de bedoeling om het model te laten werken, maar vanuit de gekozen expertise. Er zit dus een flexibel laag omheen waar de gebruiker rekening mee moet houden.\n-\tZorg in alle gevallen dat de juiste veiligheidsvoorzieningen worden getroffen.\n-\tInvesteringstabel is gemaakt met de kennis ten tijde van het ontwikkelen van het model.\n-\tEr is gekozen om geen gebruik te maken van gerecycled koelmiddel, omdat verwacht wordt dat de beschikbaarheid hiervan zal afnemen en de prijs zal stijgen."]
[]
[null,"Een tool voor de koudemiddel transitie"]
[]
[null,"Doel"]
[null,"Het bouwen van een beslisboom voor de koudemiddel transitie naar duurzame (verse) groenten en fruit bewaring waarmee de gebruiker zijn mogelijke keuzes om aan de regelgeving te voldoen, inzichtelijk kan krijgen op zowel technische als economische parameters."]
[]
[null,"Achtergrond"]
[null,"In verband met de richtlijn 2019/1937 en tot intrekking van verordening 517/2024, worden de verkoop en gebruik van koudemiddelen beperkt. Deze beslisboom is er om de groenten en fruit bewaarsector te steunen in het keuzes maken van de koudemiddelen die zou zo veel mogelijk passen bij hun bedrijf. "]
{"$rows_left_out":12}
{"sheet":"Vragenlijst","index":1,"n_rows":27,"n_cols":12,"rows_kept":27,"cut":false,"hidden":false,"merged":[[18,6,18,9]]}
[]
[null,null,null,null,null,null,null,null,null,null,"goed =3"]
[null,null,"Advies transitie koudemiddel","KLIK OP DE GROENE CEL EN DAARNA OP HET PIJLTJE DAT ERNAAST VERSCHIJNT VOOR EEN KEUZEMENU"]
[]
[null,1,"Wat is de leeftijd van uw koelsysteem?",null,null,null,null,null,null,null,{"$f":"IF(AND(D5=\"\",IF(ISNUMBER(SEARCH(\"nvt\",C5)),0,1)=1),2,3)","v":2},{"$f":"IF(AND(NOT(D5=\"\"),IF(ISNUMBER(SEARCH(\"nvt\",C5)),0,1)=0),2,3)","v":3}]
[]
[null,2,{"$f":"IF(D5=\"tenminste 25 jaar\",\"Welke koudemiddel heeft u in uw koelsysteem?(vraag NVT)\",\"Welke koudemiddel heeft u in uw koelsysteem?\")","v":"Welke koudemiddel heeft u in uw koelsysteem?"},null,null,null,{"$f":"IF(D7=\"\",\"\",\"GWP=\")","v":""},{"$f":"IF(D7=\"\",\"\",VLOOKUP(Vragenlijst!D7,dropdowns!G4:H19,2,FALSE))","v":""},null,null,{"$f":"IF(AND(D7=\"\",IF(ISNUMBER(SEARCH(\"nvt\",C7)),0,1)=1),2,3)","v":2},{"$f":"IF(AND(NOT(D7=\"\"),IF(ISNUMBER(SEARCH(\"nvt\",C7)),0,1)=0),2,3)","v":3}]
[]
[null,3,{"$f":"IF(D5=\"tenminste 25 jaar\",\"Is het koudemiddel in uw installatie het originele koudemiddel?(vraag NVT)\",\"Is het koudemiddel in uw installatie het originele koudemiddel?\")","v":"Is het koudemiddel in uw installatie het originele koudemiddel?"},null,null,null,null,null,null,null,2,3]
[]
{"$rows_left_out":18}
{"sheet":"Adviesrichting","index":2,"n_rows":32,"n_cols":12,"rows_kept":32,"cut":false,"hidden":false,"merged":[[0,0,0,1],[17,0,17,1],[17,5,17,8],[17,9,17,11],[16,5,16,11],[2,1,2,2]]}
["Adivesrichting"]
[null,"Advies voor verandering van koudemiddel voor uw installatie "]
[null,"Onderstaand vindt u een samenvatting van het advies, in relatie tot uw bestaande installatie. Elke installatie dient een eigen adviestraject te doorlopen",null,null,"Voor meer informatie over F-gassen, kijk naar het document van Bitzer"]
[null,"Omschrijving","antwoorden op de vragen",null,"zie:","over koudemiddellen: A-500-D - Refrigerants"]
[null,"1.      Leeftijd koeling systeem",{"$f":"IF(ISBLANK(Vragenlijst!D5),\"\",Vragenlijst!D5)","v":""}]
[null,"2.      Koudemiddel in gebruikt",{"$f":"IF(ISBLANK(Vragenlijst!D7),\"\",Vragenlijst!D7)","v":""},null,"Voor meer informatie over natuurlijke koudemiddelen"]
[null,"3.      Originele koudemiddel",{"$f":"IF(ISBLANK(Vragenlijst!D9),\"\",Vragenlijst!D9)","v":""},null,"zie:","Natuurlijke koudemiddelen in de koeltechniek - NVKL"]
[null,"4.      Functies koelcel",{"$f":"IF(ISBLANK(Vragenlijst!D11),\"\",Vragenlijst!D11)","v":""}]
[null,"5.      Huidige koelsysteem ",{"$f":"IF(ISBLANK(Vragenlijst!D13),\"\",Vragenlijst!D13)","v":""}]
[null,"6.      Extra elektrisch aansluiting mogelijk",{"$f":"IF(ISBLANK(Vragenlijst!D15),\"\",Vragenlijst!D15)","v":""}]
{"$rows_left_out":23}
{"sheet":"Investeringstabel","index":3,"n_rows":39,"n_cols":18,"rows_kept":39,"cut":false,"hidden":false,"merged":[[36,1,36,8],[37,1,37,8],[38,1,38,8],[23,1,23,8],[0,0,0,1],[24,1,24,8],[25,1,25,8],[26,1,26,8],[27,1,27,8],[28,1,28,8],[29,1,29,8],[30,1,30,8],[31,1,31,8],[32,1,32,8],[33,1,33,8],[34,1,34,8],[35,1,35,8],[3,17,4,17],[5,17,6,17],[7,17,8,17],[9,17,10,17],[11,17,12,17],[17,9,19,9],[17,10,19,10],[22,0,22,8],[17,5,19,5],[17,6,19,6],[17,7,19,7],[17,8,19,8],[14,4,16,4],[14,5,16,5],[14,6,16,6],[14,7,16,7],[14,8,16,8],[5,13,7,13],[5,14,7,14],[5,15,7,15],[5,9,7,9],[5,10,7,10],[5,11,7,11],[5,12,7,12],[11,8,13,8],[11,4,13,4],[11,5,13,5],[11,6,13,6],[11,7,13,7],[5,5,7,5],[2,0,3,1],[2,7,2,15],[3,4,4,4],[3,5,4,5],[3,6,4,6],[3,7,3,8],[3,9,3,10],[3,11,3,12],[3,13,3,15],[2,5,2,6]]}
["Relatief investeringstabel"]
[]
["Uitgangspunt",null,null,null,"Behoud huidig systeem (%)","Gedeeltelijke ombouw (%)",null,"4. volledige vervanging (%)"]
[null,null,null,null,"1. ombouw en wissel naar alternatief F-gas","2. beperken inhoud F-gas => indirect (koude drager) pompsysteem","3. (en) wisselen naar natuurlijk (zo mogelijk)","direct expansie",null,"direct pomp",null,"indirect pomp / CO2 secundair",null,"indirect pomp / koudedrager ",null,null,null,"De informatie, die past bij uw antwoorden, is in de investeringstabel roze gemarkeerd."]
["Systeem koelcapaciteit","Referentie koelsysteem met synthetisch koudemiddel",null,"Aandeel (%) in exploitatie kosten",null,null,null,"propaan","CO2","CO2","NH3","propaan","NH3","propaan","CO2","NH3"]
["< 25 kWatt","direct expansie (enkelvoudig)","investering",0.6,30,"n.v.t.",30,110,135,"n.v.t.","n.v.t.","n.v.t.","n.v.t.","n.v.t.","n.v.t.","n.v.t."]
["(~  tot 100 ton product)",null,"energie",0.25,105,null,100,100,106]
[null,null,"onderhoud",0.15,110,null,108,108,125]
["25-150 kWatt","direct expansie (centraal)","investering",0.63,30,70,30,110,132,155,185,145,165,140,145,155]
["(~  100 tot 1500 ton product)",null,"energie",0.25,105,120,100,100,108,110,100,107,103,110,116,108]
{"$rows_left_out":30}
{"sheet":"tussenstap advies","index":4,"n_rows":77,"n_cols":26,"rows_kept":77,"cut":false,"hidden":true,"merged":[[45,14,47,14],[45,15,47,15],[45,16,47,16],[51,5,53,5],[51,6,53,6],[51,7,53,7],[51,8,53,8],[57,10,59,10],[45,13,47,13],[45,10,47,10],[45,11,47,11],[45,12,47,12],[54,6,56,6],[54,7,56,7],[54,8,56,8],[16,0,16,1],[57,6,59,6],[57,7,59,7],[57,8,59,8],[64,2,64,9],[65,2,65,9],[1,0,1,1],[2,0,2,1],[16,9,16,11],[16,5,16,8],[42,0,43,1],[42,8,42,16],[43,8,43,9],[43,10,43,11],[43,12,43,13],[43,14,43,16],[15,5,15,11],[45,4,59,4],[45,6,47,6],[54,5,56,5],[74,2,74,9],[75,2,75,9],[76,2,76,9],[43,5,44,5],[43,6,44,6],[43,7,44,7],[70,2,70,9],[71,2,71,9],[72,2,72,9],[73,2,73,9],[66,2,66,9],[67,2,67,9],[68,2,68,9],[69,2,69,9],[62,2,62,9],[63,2,63,9]]}
[]
["Advies voor verandering van koudemiddel voor uw installatie "]
["Onderstaand vindt u een samenvatting van het advies, in relatie tot uw bestaande installatie. Elke installatie dient een eigen adviestraject te doorlopen"]
["Omschrijving","Bestaande installatie (antwoorden op de vragen)"]
["1.      Leeftijd koeling systeem",{"$f":"IF(ISBLANK(Vragenlijst!D5),\"\",Vragenlijst!D5)","v":""}]
["2.      Koudemiddel in gebruikt",{"$f":"IF(ISBLANK(Vragenlijst!D7),\"\",Vragenlijst!D7)","v":""}]
["3.      Originele koudemiddel",{"$f":"IF(ISBLANK(Vragenlijst!D9),\"\",Vragenlijst!D9)","v":""}]
["4.      Functies koelcel",{"$f":"IF(ISBLANK(Vragenlijst!D11),\"\",Vragenlijst!D11)","v":""}]
["5.      Huidige koelsysteem ",{"$f":"IF(ISBLANK(Vragenlijst!D13),\"\",Vragenlijst!D13)","v":""}]
["6.      Extra elektrisch aansluiting mogelijk",{"$f":"IF(ISBLANK(Vragenlijst!D15),\"\",Vragenlijst!D15)","v":""}]
{"$rows_left_out":68}
{"sheet":"stringopbouw advies","index":5,"n_rows":47,"n_cols":20,"rows_kept":47,"cut":false,"hidden":true,"merged":[]}
[]
[null,null,null,null,null,null,null,null,null,null,null,null,null,"aanname: niet van IDPS naar DPS (als dit wel kan, moet deze aangepast worden)"]
[null,1,2,3,4,5,6,7,8,9,10]
[null,{"$f":"IF(Vragenlijst!D5=dropdowns!C3,\"1a\",IF(Vragenlijst!D5=dropdowns!C4,\"1b\",\"1c\"))","v":"1a"},{"$f":"IF(Vragenlijst!H7=\"\",\"2a\",IF(Vragenlijst!H7>=750,\"2b\",\"2c\"))","v":"2a"},{"$f":"IF(Vragenlijst!D9=dropdowns!C9,\"3a\",IF(Vragenlijst!D9=dropdowns!C10,\"3b\",\"3c\"))","v":"3a"},{"$f":"IF(Vragenlijst!D11=dropdowns!C12,\"4a\",IF(Vragenlijst!D11=dropdowns!C13,\"4b\",IF(Vragenlijst!D11=dropdowns!C14,\"4c\",\"4d\")))","v":"4a"},{"$f":"IF(Vragenlijst!D13=dropdowns!C16,\"5a\",IF(Vragenlijst!D13=dropdowns!C17,\"5b\",IF(Vragenlijst!D13=dropdowns!C18,\"5c\",IF(Vragenlijst!D13=dropdowns!C19,\"5d\",IF(Vragenlijst!D13=dropdowns!C20,\"5e\",IF(Vragenlijst!D13=dropdowns!C21,\"5f\",\"5g\"))))))","v":"5a"},{"$f":"IF(Vragenlijst!D15=dropdowns!C23,\"6a\",IF(Vragenlijst!D15=dropdowns!C24,\"6b\",\"6c\"))","v":"6a"},{"$f":"IF(Vragenlijst!D17=dropdowns!C27,\"7a\",IF(Vragenlijst!D17=dropdowns!C28,\"7b\",IF(Vragenlijst!D17=dropdowns!C29,\"7c\",IF(Vragenlijst!D17=dropdowns!C30,\"7d\",IF(Vragenlijst!D17=dropdowns!C31,\"7e\",IF(Vragenlijst!D17=dropdowns!C32,\"7f\",IF(Vragenlijst!D17=dropdowns!C33,\"7g\",IF(Vragenlijst!D17=dropdowns!C34,\"7h\",\"7i\"))))))))","v":"7a"},{"$f":"IF(Vragenlijst!D19=dropdowns!C36,\"8a\",IF(Vragenlijst!D19=dropdowns!C37,\"8b\",IF(Vragenlijst!D19=dropdowns!C38,\"8c\",\"8d\")))","v":"8a"},{"$f":"IF(Vragenlijst!D21=dropdowns!C40,\"9a\",IF(Vragenlijst!D21=dropdowns!C41,\"9b\",\"9c\"))","v":"9a"},{"$f":"IF(Vragenlijst!D23=dropdowns!C43,\"10a\",IF(Vragenlijst!D23=dropdowns!C44,\"10b\",\"10c\"))","v":"10a"},null,null,null,null,null,null,"wanneer vervalt advies 6?"]
[null,null,null,null,null,{"$f":"LEFT(Vragenlijst!D13,4)","v":""}]
[null,null,null,null,null,null,null,null,null,null,null,null,null,null,null,null,{"$f":"IF(Q17=OR(4,6),1,0)","v":0}]
["string=",{"$f":"B4&\"\"&C4&\"\"&D4&\"\"&E4&\"\"&F4&\"\"&G4&\"\"&H4&\"\"&I4&\"\"&J4&\"\"&K4","v":"1a2a3a4a5a6a7a8a9a10a"}]
[]
["advies→",1,2,"3a","3b","4a1","4a2","4b1","4b2","4c1","4c2","4d1","4d2",5,6,7]
["vraag ↓"]
{"$rows_left_out":38}
{"sheet":"adviesopties","index":6,"n_rows":18,"n_cols":7,"rows_kept":18,"cut":false,"hidden":true,"merged":[]}
["invultekst",1]
[null,null,"gassen"]
["Mogelijk resultaten",null,"F-gas","propaan","CO2","CO2","NH3"]
[1,"Advies: Behoud van huidige systeem met gedeeltelijke ombouw & wisseling naar alternatief F-gas, gerecycled koudemiddel mogelijk tot 2030",{"$f":"B1","v":1}]
[2,"Advies: Gedeeltelijke ombouw. Tot 2030, alleen met gerecycled koudemiddel. Gedeeltelijke ombouw naar indirect koudedrager pompsysteem met F-gas <150, let op voor PFAS reglementen",{"$f":"B1","v":1}]
["3a","Advies: Gedeeltelijke ombouw met natuurlijk koudemiddelen: met CO2",null,{"$f":"B1","v":1},{"$f":"B1","v":1},null,{"$f":"B1","v":1}]
["3b","Advies: Gedeeltelijke ombouw met natuurlijk koudemiddelen: zonder CO2",null,{"$f":"B1","v":1},null,null,{"$f":"B1","v":1}]
["4a1","Advies: Volledige vervanging naar natuurlijke middelen: DXe; met CO2",null,{"$f":"B1","v":1},{"$f":"B1","v":1},null,{"$f":"B1","v":1}]
["4a2","Advies: Volledige vervanging naar natuurlijke middelen: DXe; zonder CO2",null,{"$f":"B1","v":1},null,null,{"$f":"B1","v":1}]
["4b1","Advies: Volledige vervanging naar natuurlijke middelen:DXc: met CO2",null,{"$f":"B1","v":1},{"$f":"B1","v":1},null,{"$f":"B1","v":1}]
{"$rows_left_out":9}
{"sheet":"Sheet1","index":7,"n_rows":28,"n_cols":10,"rows_kept":28,"cut":false,"hidden":true,"merged":[]}
[{"$f":"Adviesrichting!A16","v":"0-1-2-3a-3b-4a1-4a2-4b1-4b2-4c1-4c2"},null,null,"blokken met cellen, om evt. Te kleuren"]
[]
["-1-",{"$f":"ISNUMBER(SEARCH(A3,A$1))","v":true},1,"blok 1",{"$f":"IF(AND('stringopbouw advies'!Q15=1,'stringopbouw advies'!Q17=1,'stringopbouw advies'!Q18=2,ISNUMBER(SEARCH(\"DXe\",'tussenstap advies'!C19)),ISNUMBER(SEARCH(\"DXe\",'tussenstap advies'!D19))),1,0)","v":0},"E5 - E7",17,"blok 11a",{"$f":"IF(AND('stringopbouw advies'!Q15=3,OR('stringopbouw advies'!Q17=1,'stringopbouw advies'!Q17=3,'stringopbouw advies'!Q17=5),OR('stringopbouw advies'!Q18=0,'stringopbouw advies'!Q18=1),ISNUMBER(SEARCH(\"DPS\",'tussenstap advies'!C27)),ISNUMBER(SEARCH(\"DPS\",'tussenstap advies'!D27))),1,IF(AND('stringopbouw advies'!Q15=3,OR('stringopbouw advies'!Q17=1,'stringopbouw advies'!Q17=3,'stringopbouw advies'!Q17=5),OR('stringopbouw advies'!Q18=0,'stringopbouw advies'!Q18=1),ISNUMBER(SEARCH(\"DPS\",'tussenstap advies'!C28)),ISNUMBER(SEARCH(\"DPS\",'tussenstap advies'!D28))),IF('tussenstap advies'!B27=\"\",0,1),0))","v":0},"J11 - J13"]
["-2-",{"$f":"ISNUMBER(SEARCH(A4,A$1))","v":true},2,"blok 2",{"$f":"IF(AND('stringopbouw advies'!Q15=2,'stringopbouw advies'!Q17=1,'stringopbouw advies'!Q18=2,ISNUMBER(SEARCH(\"DXc\",'tussenstap advies'!C19)),ISNUMBER(SEARCH(\"DXc\",'tussenstap advies'!D19))),1,0)","v":0},"E8 - E10",18,"blok 11b",{"$f":"IF(AND('stringopbouw advies'!Q15=3,OR('stringopbouw advies'!Q17=1,'stringopbouw advies'!Q17=3,'stringopbouw advies'!Q17=5),OR('stringopbouw advies'!Q18=0,'stringopbouw advies'!Q18=1),ISNUMBER(SEARCH(\"DPS\",'tussenstap advies'!C27)),ISNUMBER(SEARCH(\"DPS\",'tussenstap advies'!D27))),1,IF(AND('stringopbouw advies'!Q15=3,OR('stringopbouw advies'!Q17=1,'stringopbouw advies'!Q17=3,'stringopbouw advies'!Q17=5),OR('stringopbouw advies'!Q18=0,'stringopbouw advies'!Q18=1),ISNUMBER(SEARCH(\"DPS\",'tussenstap advies'!C28)),ISNUMBER(SEARCH(\"DPS\",'tussenstap advies'!D28))),1,0))","v":0},"K11-K13"]
["3a",true,3,"blok 3",{"$f":"IF(AND('stringopbouw advies'!Q15=2,OR('stringopbouw advies'!Q17=4,'stringopbouw advies'!Q17=6,'stringopbouw advies'!Q17=8),'stringopbouw advies'!Q18=2,ISNUMBER(SEARCH(\"DXc\",'tussenstap advies'!C20)),ISNUMBER(SEARCH(\"IDPS\",'tussenstap advies'!D20))),1,0)","v":0},"F8 - F10",19,"blok 12a",{"$f":"IF(AND('stringopbouw advies'!Q15=3,OR('stringopbouw advies'!Q17=1,'stringopbouw advies'!Q17=4,'stringopbouw advies'!Q17=6),OR('stringopbouw advies'!Q18=0,'stringopbouw advies'!Q18=1),ISNUMBER(SEARCH(\"DPS\",'tussenstap advies'!C29)),ISNUMBER(SEARCH(\"IDPS\",'tussenstap advies'!D29))),1,IF(AND('stringopbouw advies'!Q15=3,OR('stringopbouw advies'!Q17=1,'stringopbouw advies'!Q17=4,'stringopbouw advies'!Q17=6),OR('stringopbouw advies'!Q18=0,'stringopbouw advies'!Q18=1),ISNUMBER(SEARCH(\"DPS\",'tussenstap advies'!C30)),ISNUMBER(SEARCH(\"IDPS\",'tussenstap advies'!D30))),1,0))","v":0},"L11 - L13"]
["3b",true,4,"blok 4",{"$f":"IF(AND('stringopbouw advies'!Q15=1,'stringopbouw advies'!Q17=1,OR('stringopbouw advies'!Q18=0,'stringopbouw advies'!Q18=1),OR(AND(ISNUMBER(SEARCH(\"DXe\",'tussenstap advies'!C21)),ISNUMBER(SEARCH(\"DXe\",'tussenstap advies'!D21)),AND(ISNUMBER(SEARCH(\"DXe\",'tussenstap advies'!C22)),ISNUMBER(SEARCH(\"DXe\",'tussenstap advies'!D22)))))),1,0)","v":0},"G5 - G7",20,"blok 12b",{"$f":"IF(AND('stringopbouw advies'!Q15=3,OR('stringopbouw advies'!Q17=1,'stringopbouw advies'!Q17=4,'stringopbouw advies'!Q17=6),OR('stringopbouw advies'!Q18=0,'stringopbouw advies'!Q18=1),ISNUMBER(SEARCH(\"DPS\",'tussenstap advies'!C29)),ISNUMBER(SEARCH(\"IDPS\",'tussenstap advies'!D29))),1,IF(AND('stringopbouw advies'!Q15=3,OR('stringopbouw advies'!Q17=1,'stringopbouw advies'!Q17=4,'stringopbouw advies'!Q17=6),OR('stringopbouw advies'!Q18=0,'stringopbouw advies'!Q18=1),ISNUMBER(SEARCH(\"DPS\",'tussenstap advies'!C30)),ISNUMBER(SEARCH(\"IDPS\",'tussenstap advies'!D30))),1,0))","v":0},"M11-M13"]
["4a1",true,5,"blok 5",{"$f":"IF(AND('stringopbouw advies'!Q15=2,'stringopbouw advies'!Q17=1,OR('stringopbouw advies'!Q18=0,'stringopbouw advies'!Q18=1),OR(AND(ISNUMBER(SEARCH(\"DXc\",'tussenstap advies'!C21)),ISNUMBER(SEARCH(\"DXc\",'tussenstap advies'!D21))),AND(ISNUMBER(SEARCH(\"DXc\",'tussenstap advies'!C22)),ISNUMBER(SEARCH(\"DXc\",'tussenstap advies'!D22))))),1,0)","v":0},"G8 - G10",21,"blok 13a",{"$f":"IF(AND('stringopbouw advies'!Q15=3,OR('stringopbouw advies'!Q17=1,'stringopbouw advies'!Q17=4,'stringopbouw advies'!Q17=6),OR('stringopbouw advies'!Q18=0,'stringopbouw advies'!Q18=1),ISNUMBER(SEARCH(\"DPS\",'tussenstap advies'!C29)),ISNUMBER(SEARCH(\"IDPS\",'tussenstap advies'!D29))),1,IF(AND('stringopbouw advies'!Q15=3,OR('stringopbouw advies'!Q17=1,'stringopbouw advies'!Q17=4,'stringopbouw advies'!Q17=6),OR('stringopbouw advies'!Q18=0,'stringopbouw advies'!Q18=1),ISNUMBER(SEARCH(\"DPS\",'tussenstap advies'!C30)),ISNUMBER(SEARCH(\"IDPS\",'tussenstap advies'!D30))),1,0))","v":0},"N11 - N13"]
["4a2",true,6,"blok 6a",{"$f":"IF(AND('stringopbouw advies'!Q15=1,'stringopbouw advies'!Q17=1,OR('stringopbouw advies'!Q18=0,'stringopbouw advies'!Q18=1),OR(ISNUMBER(SEARCH(\"DXe\",'tussenstap advies'!C23)),ISNUMBER(SEARCH(\"DXe\",'tussenstap advies'!C24))),OR(ISNUMBER(SEARCH(\"DXe\",'tussenstap advies'!D23)),ISNUMBER(SEARCH(\"DXe\",'tussenstap advies'!D24)))),1,IF(AND('stringopbouw advies'!Q15=1,'stringopbouw advies'!Q17=2,OR('stringopbouw advies'!Q18=0,'stringopbouw advies'!Q18=1),ISNUMBER(SEARCH(\"DXe\",'tussenstap advies'!C26)),ISNUMBER(SEARCH(\"DXc\",'tussenstap advies'!D26))),1,0))","v":0},"H5 - H7",22,"blok 13b",{"$f":"IF('stringopbouw advies'!Q20=1,0,IF(AND('stringopbouw advies'!Q15=3,OR('stringopbouw advies'!Q17=1,'stringopbouw advies'!Q17=4,'stringopbouw advies'!Q17=6),OR('stringopbouw advies'!Q18=0,'stringopbouw advies'!Q18=1),ISNUMBER(SEARCH(\"DPS\",'tussenstap advies'!C29)),ISNUMBER(SEARCH(\"IDPS\",'tussenstap advies'!D29))),1,IF(AND('stringopbouw advies'!Q15=3,OR('stringopbouw advies'!Q17=1,'stringopbouw advies'!Q17=4,'stringopbouw advies'!Q17=6),OR('stringopbouw advies'!Q18=0,'stringopbouw advies'!Q18=1),ISNUMBER(SEARCH(\"DPS\",'tussenstap advies'!C30)),ISNUMBER(SEARCH(\"IDPS\",'tussenstap advies'!D30))),1,0)))","v":0},"O11-O13"]
["4b1",true,7,"blok 6b",{"$f":"IF('stringopbouw advies'!Q20=1,0,IF(AND('stringopbouw advies'!Q15=1,'stringopbouw advies'!Q17=1,OR('stringopbouw advies'!Q18=0,'stringopbouw advies'!Q18=1),OR(ISNUMBER(SEARCH(\"DXe\",'tussenstap advies'!C23)),ISNUMBER(SEARCH(\"DXe\",'tussenstap advies'!C24))),OR(ISNUMBER(SEARCH(\"DXe\",'tussenstap advies'!D23)),ISNUMBER(SEARCH(\"DXe\",'tussenstap advies'!D24)))),1,IF(AND('stringopbouw advies'!Q15=1,'stringopbouw advies'!Q17=2,OR('stringopbouw advies'!Q18=0,'stringopbouw advies'!Q18=1),ISNUMBER(SEARCH(\"DXe\",'tussenstap advies'!C26)),ISNUMBER(SEARCH(\"DXc\",'tussenstap advies'!D26))),1,0)))","v":0},"I5-I7",23,"blok 13c",{"$f":"IF(AND('stringopbouw advies'!Q15=3,OR('stringopbouw advies'!Q17=1,'stringopbouw advies'!Q17=4,'stringopbouw advies'!Q17=6),OR('stringopbouw advies'!Q18=0,'stringopbouw advies'!Q18=1),ISNUMBER(SEARCH(\"DPS\",'tussenstap advies'!C29)),ISNUMBER(SEARCH(\"IDPS\",'tussenstap advies'!D29))),1,IF(AND('stringopbouw advies'!Q15=3,OR('stringopbouw advies'!Q17=1,'stringopbouw advies'!Q17=4,'stringopbouw advies'!Q17=6),OR('stringopbouw advies'!Q18=0,'stringopbouw advies'!Q18=1),ISNUMBER(SEARCH(\"DPS\",'tussenstap advies'!C30)),ISNUMBER(SEARCH(\"IDPS\",'tussenstap advies'!D30))),1,0))","v":0},"P11-P13"]
["4b2",true,8,"blok 7a",{"$f":"IF(AND('stringopbouw advies'!Q15=2,'stringopbouw advies'!Q17=1,OR('stringopbouw advies'!Q18=0,'stringopbouw advies'!Q18=1),OR(ISNUMBER(SEARCH(\"DXc\",'tussenstap advies'!C25)),ISNUMBER(SEARCH(\"DXc\",'tussenstap advies'!C26))),OR(ISNUMBER(SEARCH(\"DXc\",'tussenstap advies'!D25)),ISNUMBER(SEARCH(\"DXc\",'tussenstap advies'!D26)))),1,0)","v":0},"H8 - H10",24,"blok 14a",{"$f":"IF(AND('stringopbouw advies'!Q15=4,OR('stringopbouw advies'!Q17=1,'stringopbouw advies'!Q17=3,'stringopbouw advies'!Q17=5,'stringopbouw advies'!Q17=7),OR('stringopbouw advies'!Q18=0,'stringopbouw advies'!Q18=1),ISNUMBER(SEARCH(\"DPS\",'tussenstap advies'!C27)),ISNUMBER(SEARCH(\"DPS\",'tussenstap advies'!D27))),1,IF(AND('stringopbouw advies'!Q15=4,OR('stringopbouw advies'!Q17=1,'stringopbouw advies'!Q17=3,'stringopbouw advies'!Q17=5,'stringopbouw advies'!Q17=7),OR('stringopbouw advies'!Q18=0,'stringopbouw advies'!Q18=1),ISNUMBER(SEARCH(\"DPS\",'tussenstap advies'!C28)),ISNUMBER(SEARCH(\"DPS\",'tussenstap advies'!D28))),IF('tussenstap advies'!B27=\"\",0,1),0))","v":0},"J14 - J16"]
{"$rows_left_out":19}
{"sheet":"koudemiddelen","index":8,"n_rows":31,"n_cols":10,"rows_kept":31,"cut":false,"hidden":true,"merged":[]}
[]
["huidig koudemiddel","GWP","alternatief 1","GWP alt 1","alternatief 2","GWP alt 2","alternatief 3","GWP alt 3","alternatief 4","GWP alt 4"]
[]
["R12","f.o.","R1234yf (XL10)","0.5","R513a (with R134a)",629,"R456a",684,"R152a",164]
["R22","f.o.","R454a",465,"R447a",582]
["R404a",3922,"R454a",465,"R447a",582,"R455A",166]
["R507",3985,"R454a",465,"R447a",582,"R455A",166]
["R134a",1430,"R1234yf (XL10)","0.5","R513a",629,"R456a",684,"R456a",684]
["R442d",1888,"R454a",465,"R447a",582,"R455A",166]
["R449a",1411,"R454a",465,"R447a",582,"R455A",166]
{"$rows_left_out":22}
{"sheet":"dropdowns","index":9,"n_rows":45,"n_cols":13,"rows_kept":45,"cut":false,"hidden":true,"merged":[]}
[]
[null,null,null,null,null,null,null,null,null,null,null,null,{"$f":"IF(Vragenlijst!K27=1,\"Resultaat\",\"\")","v":""}]
[1,"a",null,null,"1a",null,null,null,null,null,{"$f":"IF(Vragenlijst!K27=0,\"U kunt naar het resultaat als alle vragen zijn ingevuld, en de vragen, die eventueel roze geworden zijn GEEN antwoord hebben (maak het antwoord dus leeg als het dat niet is)\",\"\")","v":"U kunt naar het resultaat als alle vragen zijn ingevuld, en de vragen, die eventueel roze geworden zijn GEEN antwoord hebben (maak het antwoord dus leeg als het dat niet is)"}]
[null,"b","tenminste 25 jaar",null,"1b",null,"R12",8500,"f.o"]
[null,"c","minder dan 25 jaar",null,"1c",null,"R1234yf (XL10)","0.5","f.o."]
[2,"a",null,null,"2a",null,"R134a",1430]
[null,"b","tenminste 750 GWP",null,"2b",null,"R22",1810]
[null,"c","minder dan 750 GWP",null,"2c",null,"R404a",3922]
[3,"a",null,null,"3a",null,"R407f",1774]
[null,"b","nee",null,"3b",null,"R442d",1888]
{"$rows_left_out":36}
{"sheet":"dynamische dropdowns","index":10,"n_rows":23,"n_cols":5,"rows_kept":23,"cut":false,"hidden":true,"merged":[]}
[null,"beginsysteem"]
[null,"5a",null,"5b","5c"]
["DXe (Directe Expansie enkelvoudig); Koelvermogen < 25 kW","5b"]
["DXc (Directe expansie centraal); Koelvermogen  25-150 kW","5c",null,"gelijk koelvermogen","gelijk koelvermogen"]
["DPS (Direct pompsysteem); Koelvermogen 150-500 kW","5d",null,"verhoging: naar 25-150 kW (DXc)","verhoging: naar 150-500 kW (direct pompsysteem (DPS))"]
["DPS (Direct pompsysteem); Koelvermogen >500 kW","5e",null,null,"verhoging: naar 150-500 kW (indirect pompsysteem (IDPS))"]
["IDPS (Indirect pompsysteem); Koelvermogen 150-500 kW","5f",null,null,"verhoging: van minder naar meer dan 500 kW (direct pomp systeem (DPS))"]
["IDPS (Indirect pompsysteem); Koelvermogen >500 kW","5g",null,null,"verhoging: van minder naar meer dan 500 kW (indirect pompsysteem (IDPS))"]
[]
[]
{"$rows_left_out":13}